Target
Tyrosine-protein kinase JAK2 [808-1132]
Ligand
BDBM348916
Substrate
Meas. Tech.
JAK2 Inhibition Assay
IC50
<100±n/a nM
Citation
 Menet, CJVan Rompaey, LJFletcher, SRBlanc, JJouannigot, NHodges, AJSmits, KK Compounds useful for the treatment of degenerative and inflammatory diseases US Patent  US10206907 Publication Date 2/19/2019 
Target
Name:
Tyrosine-protein kinase JAK2 [808-1132]
Synonyms:
JAK2 JAK2_HUMAN | Tyrosine-protein kinase JAK2 JH1 (808-1132)
Type:
Protein
Mol. Mass.:
39171.39
Organism:
Homo sapiens (Human)
Description:
O60674[808-1132]
Residue:
335
  
Inhibitor
Name:
BDBM348916
Synonyms:
4-(2- (cyclopropanecarboxamido)- [1,2.4]triazolo[1,5-a]pyridin-5- yl)-N-methyl-N- phenylbenzamide | US10206907, Compound 30
Type:
Small organic molecule
Emp. Form.:
C24H21N5O2
Mol. Mass.:
411.4558
SMILES:
CN(C(=O)c1ccc(cc1)-c1cccc2nc(NC(=O)C3CC3)nn12)c1ccccc1
: