Target
Bromodomain-containing protein 4
Ligand
BDBM342574
Substrate
Ki
17500±n/a nM
Citation
 Pratt, JKLiu, DPark, CHSheppard, GSHasvold, LAWang, L Isoindolone derivatives US Patent  US9776990 Publication Date 10/3/2017 
Target
Name:
Bromodomain-containing protein 4
Synonyms:
BRD4 Bromodomain-containing protein 4 (BRD4) Protein HUNK1
Type:
Protein
Mol. Mass.:
152264.84
Organism:
Homo sapiens (Human)
Description:
O60885
Residue:
1362
  
Inhibitor
Name:
BDBM342574
Synonyms:
1-(3,5-dimethylphenyl)-3-methyl-2,5,6,7-tetrahydro-4H-isoindol-4-one | US9776990, Example 17
Type:
Small organic molecule
Emp. Form.:
C17H19NO
Mol. Mass.:
253.3389
SMILES:
Cc1[nH]c(c2CCCC(=O)c12)-c1cc(C)cc(C)c1
: