Target
Bromodomain-containing protein 4
Ligand
BDBM342575
Substrate
Meas. Tech.
TR-FRET Assay
Ki
943±n/a nM
Citation
 Pratt, JKLiu, DPark, CHSheppard, GSHasvold, LAWang, L Isoindolone derivatives US Patent  US9776990 Publication Date 10/3/2017 
Target
Name:
Bromodomain-containing protein 4
Synonyms:
BRD4 Bromodomain-containing protein 4 (BRD4) Protein HUNK1
Type:
Protein
Mol. Mass.:
152264.84
Organism:
Homo sapiens (Human)
Description:
O60885
Residue:
1362
  
Inhibitor
Name:
BDBM342575
Synonyms:
1-[2-(benzyloxy)phenyl]-3-methyl-2,5,6,7-tetrahydro-4H-isoindol-4-one | US9776990, Example 18
Type:
Small organic molecule
Emp. Form.:
C22H21NO2
Mol. Mass.:
331.4076
SMILES:
Cc1[nH]c(c2CCCC(=O)c12)-c1ccccc1OCc1ccccc1
: