Target
Bromodomain-containing protein 4
Ligand
BDBM342579
Substrate
Ki
8210±n/a nM
Citation
 Pratt, JKLiu, DPark, CHSheppard, GSHasvold, LAWang, L Isoindolone derivatives US Patent  US9776990 Publication Date 10/3/2017 
Target
Name:
Bromodomain-containing protein 4
Synonyms:
BRD4 Bromodomain-containing protein 4 (BRD4) Protein HUNK1
Type:
Protein
Mol. Mass.:
152264.84
Organism:
Homo sapiens (Human)
Description:
O60885
Residue:
1362
  
Inhibitor
Name:
BDBM342579
Synonyms:
1-(1H-indol-7-yl)-3-methyl-2,5,6,7-tetrahydro-4H-isoindol-4-one | US9776990, Example 22
Type:
Small organic molecule
Emp. Form.:
C17H16N2O
Mol. Mass.:
264.3217
SMILES:
Cc1[nH]c(c2CCCC(=O)c12)-c1cccc2cc[nH]c12
: