Target
Bromodomain-containing protein 4
Ligand
BDBM342607
Substrate
Ki
551±n/a nM
Citation
 Pratt, JKLiu, DPark, CHSheppard, GSHasvold, LAWang, L Isoindolone derivatives US Patent  US9776990 Publication Date 10/3/2017 
Target
Name:
Bromodomain-containing protein 4
Synonyms:
BRD4 Bromodomain-containing protein 4 (BRD4) Protein HUNK1
Type:
Protein
Mol. Mass.:
152264.84
Organism:
Homo sapiens (Human)
Description:
O60885
Residue:
1362
  
Inhibitor
Name:
BDBM342607
Synonyms:
N-[4-(2,4-difluorophenoxy)-3-(3-methyl-4-oxo-4,5,6,7-tetrahydro-2H-isoindol-1-yl)phenyl]acetamide | US9776990, Example 50
Type:
Small organic molecule
Emp. Form.:
C23H20F2N2O3
Mol. Mass.:
410.4133
SMILES:
CC(=O)Nc1ccc(Oc2ccc(F)cc2F)c(c1)-c1[nH]c(C)c2c1CCCC2=O
: