Target
Bromodomain-containing protein 4
Ligand
BDBM342609
Substrate
Ki
88.0±n/a nM
Citation
 Pratt, JKLiu, DPark, CHSheppard, GSHasvold, LAWang, L Isoindolone derivatives US Patent  US9776990 Publication Date 10/3/2017 
Target
Name:
Bromodomain-containing protein 4
Synonyms:
BRD4 Bromodomain-containing protein 4 (BRD4) Protein HUNK1
Type:
Protein
Mol. Mass.:
152264.84
Organism:
Homo sapiens (Human)
Description:
O60885
Residue:
1362
  
Inhibitor
Name:
BDBM342609
Synonyms:
N-{4-[(4,4-difluorocyclohexyl)oxy]-3-(3-methyl-4-oxo-4,5,6,7-tetrahydro-2H-isoindol-1-yl)phenyl}ethanesulfonamide | US9776990, Example 52
Type:
Small organic molecule
Emp. Form.:
C23H28F2N2O4S
Mol. Mass.:
466.541
SMILES:
CCS(=O)(=O)Nc1ccc(OC2CCC(F)(F)CC2)c(c1)-c1[nH]c(C)c2c1CCCC2=O
: