Target
Bromodomain-containing protein 4
Ligand
BDBM342612
Substrate
Meas. Tech.
TR-FRET Assay
Ki
77.0±n/a nM
Citation
 Pratt, JKLiu, DPark, CHSheppard, GSHasvold, LAWang, L Isoindolone derivatives US Patent  US9776990 Publication Date 10/3/2017 
Target
Name:
Bromodomain-containing protein 4
Synonyms:
BRD4 Bromodomain-containing protein 4 (BRD4) Protein HUNK1
Type:
Protein
Mol. Mass.:
152264.84
Organism:
Homo sapiens (Human)
Description:
O60885
Residue:
1362
  
Inhibitor
Name:
BDBM342612
Synonyms:
N-ethyl-3-(3-methyl-4-oxo-4,5,6,7-tetrahydro-2H-isoindol-1-yl)-4-phenoxybenzamide | US9776990, Example 55
Type:
Small organic molecule
Emp. Form.:
C24H24N2O3
Mol. Mass.:
388.459
SMILES:
CCNC(=O)c1ccc(Oc2ccccc2)c(c1)-c1[nH]c(C)c2c1CCCC2=O
: