Target
Bromodomain-containing protein 4
Ligand
BDBM342619
Substrate
Ki
1750±n/a nM
Citation
 Pratt, JKLiu, DPark, CHSheppard, GSHasvold, LAWang, L Isoindolone derivatives US Patent  US9776990 Publication Date 10/3/2017 
Target
Name:
Bromodomain-containing protein 4
Synonyms:
BRD4 Bromodomain-containing protein 4 (BRD4) Protein HUNK1
Type:
Protein
Mol. Mass.:
152264.84
Organism:
Homo sapiens (Human)
Description:
O60885
Residue:
1362
  
Inhibitor
Name:
BDBM342619
Synonyms:
1-[2-(benzyloxy)phenyl]-3,6,6-trimethyl-2,5,6,7-tetrahydro-4H-isoindol-4-one | US9776990, Example 62
Type:
Small organic molecule
Emp. Form.:
C24H25NO2
Mol. Mass.:
359.4608
SMILES:
Cc1[nH]c(c2CC(C)(C)CC(=O)c12)-c1ccccc1OCc1ccccc1
: