Target
Geranylgeranyl transferase type-1 subunit beta/Protein farnesyltransferase/geranylgeranyltransferase type-1 subunit alpha
Ligand
BDBM14434
Substrate
Ha-Ras-CVLL
Meas. Tech.
FTase Activity Assay
IC50
1100±n/a nM
Citation
 Li, QWoods, KWWang, WLin, NHClaiborne, AGu, WZCohen, JStoll, VSHutchins, CFrost, DRosenberg, SHSham, HL Design, synthesis, and activity of achiral analogs of 2-quinolones and indoles as non-thiol farnesyltransferase inhibitors. Bioorg Med Chem Lett 15:2033-9 (2005)  
Target
Name:
Geranylgeranyl transferase type-1 subunit beta/Protein farnesyltransferase/geranylgeranyltransferase type-1 subunit alpha
Synonyms:
Geranylgeranyl Transferase (GGTase-I) Geranylgeranyl transferase type I
Type:
Protein Complex
Mol. Mass.:
Description:
Components:
This complex has 2 components.
Component 1
Name:
Protein farnesyltransferase/geranylgeranyltransferase type-1 subunit alpha
Synonyms:
CAAX farnesyltransferase alpha subunit FNTA_BOVIN GGTase-I-alpha Protein Farnesyltransferase (PFT) Chain A Protein farnesyltransferase/geranylgeranyltransferase type I alpha subunit Type I protein geranyl-geranyltransferase alpha subunit
Type:
Enzyme
Mol. Mass.:
43827.38
Organism:
Bos taurus (bovine)
Description:
The enzyme was purified from a bovine brain homogenate by sequential ammonium sulfate fractionation and affinity chromatography.
Residue:
375
  
Component 2
Name:
Geranylgeranyl transferase type-1 subunit beta
Synonyms:
GGTase-I-beta Geranylgeranyl transferase type-1 subunit beta PGTB1_BOVIN | Type I protein geranyl-geranyltransferase subunit beta
Type:
Enzyme
Mol. Mass.:
42483.88
Organism:
Bos taurus (bovine)
Description:
Purified from bovine brain
Residue:
377
  
Inhibitor
Name:
BDBM14434
Synonyms:
6-[amino(4-chlorophenyl)(1-methyl-1H-imidazol-5-yl)methyl]-4-(3-chlorophenyl)-1-methyl-1,2-dihydroquinolin-2-one R-115777 Zarnestra Tipifarnib | Zarnestra
Type:
Small organic molecule
Emp. Form.:
C27H22Cl2N4O
Mol. Mass.:
489.396
SMILES:
Cn1cncc1C(N)(c1ccc(Cl)cc1)c1ccc2n(C)c(=O)cc(-c3cccc(Cl)c3)c2c1
:
Substrate
Name:
Ha-Ras-CVLL
Synonyms:
H-Ras Mutant (S189L) Ras-CVLL
Type:
Other Protein Type
Mol. Mass.:
21319.45
Organism:
Homo sapiens (Human)
Description:
Protein was expressed and purified from E. coli. [3H]-geranylgeranylpyrophosphate (525 nM) as co-substrate.
Residue:
189