Target
Bifunctional epoxide hydrolase 2
Ligand
BDBM342635
Substrate
Meas. Tech.
Biochemical Screening Assay
IC50
0.432±n/a nM
Citation
 Mendez-Perez, MBreitschopf, KLorenz, KStrobel, HWang, LSchiffer, AGoerlitzer, J Thienomethylpiperazine derivatives as inhibitors of soluble epoxide hydrolase US Patent  US9776991 Publication Date 10/3/2017 
Target
Name:
Bifunctional epoxide hydrolase 2
Synonyms:
Cytosolic epoxide hydrolase 2 EPHX2 HYES_HUMAN Soluble epoxide hydrolase (sEH) | epoxide hydrolase 2, cytoplasmic
Type:
Enzyme
Mol. Mass.:
62613.07
Organism:
Homo sapiens (Human)
Description:
P34913
Residue:
555
  
Inhibitor
Name:
BDBM342635
Synonyms:
5-[4-((1R,2R)-2-Phenyl-cyclopropane-carbonyl)-piperazin-1-ylmethyl]-thiophene-2-carboxylic acid (3-methyl-butyl)-amide | US9776991, Example 5
Type:
Small organic molecule
Emp. Form.:
C25H33N3O2S
Mol. Mass.:
439.613
SMILES:
CC(C)CCNC(=O)c1ccc(CN2CCN(CC2)C(=O)[C@@H]2C[C@H]2c2ccccc2)s1
: