Target
Bifunctional epoxide hydrolase 2
Ligand
BDBM342691
Substrate
Meas. Tech.
Biochemical Screening Assay
IC50
1.18±n/a nM
Citation
 Mendez-Perez, MBreitschopf, KLorenz, KStrobel, HWang, LSchiffer, AGoerlitzer, J Thienomethylpiperazine derivatives as inhibitors of soluble epoxide hydrolase US Patent  US9776991 Publication Date 10/3/2017 
Target
Name:
Bifunctional epoxide hydrolase 2
Synonyms:
Cytosolic epoxide hydrolase 2 EPHX2 HYES_HUMAN Soluble epoxide hydrolase (sEH) | epoxide hydrolase 2, cytoplasmic
Type:
Enzyme
Mol. Mass.:
62613.07
Organism:
Homo sapiens (Human)
Description:
P34913
Residue:
555
  
Inhibitor
Name:
BDBM342691
Synonyms:
5-[4-(2-Hydroxy-propionyl)-piperazin-1-ylmethyl]-thiophene-2-carboxylic acid 2-chloro-4-cyano-benzylamide | US9776991, Example 61
Type:
Small organic molecule
Emp. Form.:
C21H23ClN4O3S
Mol. Mass.:
446.95
SMILES:
CC(O)C(=O)N1CCN(Cc2ccc(s2)C(=O)NCc2ccc(cc2Cl)C#N)CC1
: