Target
cAMP and cAMP-inhibited cGMP 3',5'-cyclic phosphodiesterase 10A
Ligand
BDBM343323
Substrate
Meas. Tech.
Phosphodiersterase Evaluation Assay
IC50
<5±n/a nM
Citation
 Okano, AOgawa, K Pyrazole derivative US Patent  US9777000 Publication Date 10/3/2017 
Target
Name:
cAMP and cAMP-inhibited cGMP 3',5'-cyclic phosphodiesterase 10A
Synonyms:
3',5'-cyclic phosphodiesterase PDE10_HUMAN Phosphodiesterase 10A
Type:
Protein
Mol. Mass.:
88412.52
Organism:
Homo sapiens (Human)
Description:
Q9Y233
Residue:
779
  
Inhibitor
Name:
BDBM343323
Synonyms:
(S)-1-methyl-4-(4-methylpyridin-2-yl)-N-(2-(2-methylpyrrolidin-1-yl)-[1,2,4]triazolo[1,5-a]pyridin-7-yl)-1H-pyrazole-5-carboxamide | US9777000, Example 4.4
Type:
Small organic molecule
Emp. Form.:
C22H24N8O
Mol. Mass.:
416.479
SMILES:
C[C@H]1CCCN1c1nc2cc(NC(=O)c3c(cnn3C)-c3cc(C)ccn3)ccn2n1
: