Target
cAMP and cAMP-inhibited cGMP 3',5'-cyclic phosphodiesterase 10A
Ligand
BDBM343332
Substrate
Meas. Tech.
Phosphodiersterase Evaluation Assay
IC50
<5±n/a nM
Citation
 Okano, AOgawa, K Pyrazole derivative US Patent  US9777000 Publication Date 10/3/2017 
Target
Name:
cAMP and cAMP-inhibited cGMP 3',5'-cyclic phosphodiesterase 10A
Synonyms:
3',5'-cyclic phosphodiesterase PDE10_HUMAN Phosphodiesterase 10A
Type:
Protein
Mol. Mass.:
88412.52
Organism:
Homo sapiens (Human)
Description:
Q9Y233
Residue:
779
  
Inhibitor
Name:
BDBM343332
Synonyms:
(R)-N-(2-(3-fluoropyrrolidin-1-yl)-[1,2,4]triazolo[1,5-a]pyridin-7-yl)-1-methyl-4-(4-(trifluoromethyl)thiazol-2-yl)-1H-pyrazole-5-carboxamide | US9777000, Example 4.13
Type:
Small organic molecule
Emp. Form.:
C19H16F4N8OS
Mol. Mass.:
480.442
SMILES:
Cn1ncc(-c2nc(cs2)C(F)(F)F)c1C(=O)Nc1ccn2nc(nc2c1)N1CC[C@@H](F)C1
: