Target
cAMP and cAMP-inhibited cGMP 3',5'-cyclic phosphodiesterase 10A
Ligand
BDBM343335
Substrate
Meas. Tech.
Phosphodiersterase Evaluation Assay
IC50
<5±n/a nM
Citation
 Okano, AOgawa, K Pyrazole derivative US Patent  US9777000 Publication Date 10/3/2017 
Target
Name:
cAMP and cAMP-inhibited cGMP 3',5'-cyclic phosphodiesterase 10A
Synonyms:
3',5'-cyclic phosphodiesterase PDE10_HUMAN Phosphodiesterase 10A
Type:
Protein
Mol. Mass.:
88412.52
Organism:
Homo sapiens (Human)
Description:
Q9Y233
Residue:
779
  
Inhibitor
Name:
BDBM343335
Synonyms:
(S)-N-(2-(3-fluoropyrrolidin-1-yl)-[1,2,4]triazolo[1,5-a]pyridin-7-yl)-1-methyl-4-(4-methylpyridin-2-yl)-1H-pyrazole-5-carboxamide | US9777000, Example 4.17
Type:
Small organic molecule
Emp. Form.:
C21H21FN8O
Mol. Mass.:
420.4428
SMILES:
Cc1ccnc(c1)-c1cnn(C)c1C(=O)Nc1ccn2nc(nc2c1)N1CC[C@H](F)C1
: