Target
cAMP and cAMP-inhibited cGMP 3',5'-cyclic phosphodiesterase 10A
Ligand
BDBM343393
Substrate
Meas. Tech.
Phosphodiersterase Evaluation Assay
IC50
52±n/a nM
Citation
 Okano, AOgawa, K Pyrazole derivative US Patent  US9777000 Publication Date 10/3/2017 
Target
Name:
cAMP and cAMP-inhibited cGMP 3',5'-cyclic phosphodiesterase 10A
Synonyms:
3',5'-cyclic phosphodiesterase PDE10_HUMAN Phosphodiesterase 10A
Type:
Protein
Mol. Mass.:
88412.52
Organism:
Homo sapiens (Human)
Description:
Q9Y233
Residue:
779
  
Inhibitor
Name:
BDBM343393
Synonyms:
4-(2,5-dimethylthiazol-4-yl)-1-methyl-N-(2-phenyl-5,6,7,8-tetrahydro-[1,2,4]triazolo[1,5-a]pyridin-7-yl)-1H-pyrazole-5-carboxamide | US9777000, Example 5.39
Type:
Small organic molecule
Emp. Form.:
C22H23N7OS
Mol. Mass.:
433.529
SMILES:
Cc1nc(c(C)s1)-c1cnn(C)c1C(=O)NC1CCn2nc(nc2C1)-c1ccccc1
: