Target
Bromodomain-containing protein 4 [42-168]
Ligand
BDBM343424
Substrate
Meas. Tech.
AlphaScreen Assay
IC50
<100±n/a nM
Citation
 Shepard, SShao, LWang, H Tricyclic heterocycles as bet protein inhibitors US Patent  US9777003 Publication Date 10/3/2017 
Target
Name:
Bromodomain-containing protein 4 [42-168]
Synonyms:
BRD4 BRD4_HUMAN HUNK1
Type:
Enzyme Catalytic Domain
Mol. Mass.:
15054.68
Organism:
Homo sapiens (Human)
Description:
O60885[42-168]
Residue:
127
  
Inhibitor
Name:
BDBM343424
Synonyms:
US10442803, Example 23 US9777003, Example 23
Type:
Small organic molecule
Emp. Form.:
C17H16N4O
Mol. Mass.:
292.3351
SMILES:
Cc1cc2c(ccc3nnc(C)n23)n1Cc1cccc(O)c1
: