Target
Bromodomain-containing protein 4 [42-168]
Ligand
BDBM343493
Substrate
Meas. Tech.
AlphaScreen Assay
IC50
<100±n/a nM
Citation
 Shepard, SShao, LWang, H Tricyclic heterocycles as bet protein inhibitors US Patent  US9777003 Publication Date 10/3/2017 
Target
Name:
Bromodomain-containing protein 4 [42-168]
Synonyms:
BRD4 BRD4_HUMAN HUNK1
Type:
Enzyme Catalytic Domain
Mol. Mass.:
15054.68
Organism:
Homo sapiens (Human)
Description:
O60885[42-168]
Residue:
127
  
Inhibitor
Name:
BDBM343493
Synonyms:
US10442803, Example 92 US9777003, Example 92
Type:
Small organic molecule
Emp. Form.:
C25H24N8O2S
Mol. Mass.:
500.575
SMILES:
Cc1nnc2ccc3n(Cc4ccccc4)c(cc3n12)-c1ccn(n1)C1(CC#N)CN(C1)S(C)(=O)=O
: