Target
Bromodomain-containing protein 4 [42-168]
Ligand
BDBM343497
Substrate
Meas. Tech.
AlphaScreen Assay
IC50
<100±n/a nM
Citation
 Shepard, SShao, LWang, H Tricyclic heterocycles as bet protein inhibitors US Patent  US9777003 Publication Date 10/3/2017 
Target
Name:
Bromodomain-containing protein 4 [42-168]
Synonyms:
BRD4 BRD4_HUMAN HUNK1
Type:
Enzyme Catalytic Domain
Mol. Mass.:
15054.68
Organism:
Homo sapiens (Human)
Description:
O60885[42-168]
Residue:
127
  
Inhibitor
Name:
BDBM343497
Synonyms:
US10442803, Example 96 US9777003, Example 96
Type:
Small organic molecule
Emp. Form.:
C24H25N7O
Mol. Mass.:
427.5016
SMILES:
CCNC(=O)CCn1ccc(n1)-c1cc2c(ccc3nnc(C)n23)n1Cc1ccccc1
: