Target
Bromodomain-containing protein 4 [42-168]
Ligand
BDBM343543
Substrate
Meas. Tech.
AlphaScreen Assay
IC50
<100±n/a nM
Citation
 Shepard, SShao, LWang, H Tricyclic heterocycles as bet protein inhibitors US Patent  US9777003 Publication Date 10/3/2017 
Target
Name:
Bromodomain-containing protein 4 [42-168]
Synonyms:
BRD4 BRD4_HUMAN HUNK1
Type:
Enzyme Catalytic Domain
Mol. Mass.:
15054.68
Organism:
Homo sapiens (Human)
Description:
O60885[42-168]
Residue:
127
  
Inhibitor
Name:
BDBM343543
Synonyms:
US10442803, Example 142 US9777003, Example 142
Type:
Small organic molecule
Emp. Form.:
C24H28ClN7O
Mol. Mass.:
465.978
SMILES:
CNC(=O)Nc1cc2n(Cc3cc(Cl)cc(CN4CCCC4)c3)c(C)cc2n2c(C)nnc12
: