Target
Isoform 2 of MAP kinase-interacting serine/threonine-protein kinase 1 (MNK1a) 344D]
Ligand
BDBM343678
Substrate
Meas. Tech.
Kinase High ATP Assay
IC50
20.0±n/a nM
Citation
 Eis, KPuehler, FZorn, LSchulze, VSülzle, DLienau, PHägebarth, APetersen, KBömer, U Amino-substituted imidazopyridazines US Patent  US9777004 Publication Date 10/3/2017 
Target
Name:
Isoform 2 of MAP kinase-interacting serine/threonine-protein kinase 1 (MNK1a) 344D]
Synonyms:
Isoform 2 of MAP kinase-interacting serine/threonine-protein kinase 1 (MNK1a) 344D] MAP kinase signal-integrating kinase 1 (MNK1) (T344D) MAP kinase-interacting serine/threonine-protein kinase 1 (MKNK1) (T344D) MAP kinase-interacting serine/threonine-protein kinase 1 (MNK1a) [T344D] MKNK1 MKNK1_HUMAN MNK1a
Type:
Protein
Mol. Mass.:
47416.00
Organism:
Homo sapiens (Human)
Description:
Q9BUB5-2 with T344D
Residue:
424
  
Inhibitor
Name:
BDBM343678
Synonyms:
3-{[3-(1-Benzofuran-2-yl)imidazo[1,2-b]pyridazin-6-yl]oxy}-N-(propan-2-yl)propan-1-amine | US9777004, 9
Type:
Small organic molecule
Emp. Form.:
C20H22N4O2
Mol. Mass.:
350.4143
SMILES:
CC(C)NCCCOc1ccc2ncc(-c3cc4ccccc4o3)n2n1
: