Target
Methylosome protein 50/Protein arginine N-methyltransferase 5
Ligand
BDBM343904
Substrate
Meas. Tech.
Enzyme Assay
IC50
25000±n/a nM
Citation
 Duncan, KWChesworth, RMunchhof, MJJin, L PRMT5 inhibitors and uses thereof US Patent  US9777008 Publication Date 10/3/2017 
Target
Name:
Methylosome protein 50/Protein arginine N-methyltransferase 5
Synonyms:
PRMT5 PRMT5/MEP50 Enzyme | PRMT5/MEP50 complex
Type:
Protein
Mol. Mass.:
Description:
Components:
This complex has 2 components.
Component 1
Name:
Protein arginine N-methyltransferase 5
Synonyms:
72 kDa ICln-binding protein HRMT1L5 IBP72 Jak-binding protein 1 PRMT5/MEP50 complex Protein arginine methyltransferase 5 (PRMT5) SKB1 homolog Shk1 kinase-binding protein 1 homolog
Type:
Enzyme
Mol. Mass.:
72679.99
Organism:
Homo sapiens (Human)
Description:
O14744
Residue:
637
  
Component 2
Name:
Methylosome protein 50
Synonyms:
Androgen receptor cofactor p44 MEP50 Nbla10071 WD45 p44/Mep50
Type:
Enzyme
Mol. Mass.:
36713.38
Organism:
Homo sapiens (Human)
Description:
Q9BQA1
Residue:
342
  
Inhibitor
Name:
BDBM343904
Synonyms:
US9777008, Compound 198
Type:
Small organic molecule
Emp. Form.:
C23H25N3O4
Mol. Mass.:
407.4623
SMILES:
CN(C(=O)c1cocn1)c1cccc(OCC(O)CN2CCc3ccccc3C2)c1
: