Target
Retinol-binding protein 4
Ligand
BDBM249462
Substrate
Meas. Tech.
Scintillation Proximity Binding Assay
IC50
14.0±n/a nM
Citation
 Petrukhin, KCioffi, CJohnson, GAllikmets, RFreeman, EChen, PConlon, MZhu, L Substituted 4-phenylpiperidines, their preparation and use US Patent  US9777010 Publication Date 10/3/2017 
Target
Name:
Retinol-binding protein 4
Synonyms:
PRBP RBP RET4_HUMAN Retinol-binding protein 4 (RBP4) | spa binding assay for rbp4
Type:
Protein
Mol. Mass.:
23008.75
Organism:
Homo sapiens (Human)
Description:
P02753
Residue:
201
  
Inhibitor
Name:
BDBM249462
Synonyms:
US10072016, Compound 40 US10913746, Compound 40 US9434727, 40 | US9777010, Compound 40
Type:
Small organic molecule
Emp. Form.:
C18H20ClFN4O
Mol. Mass.:
362.829
SMILES:
Fc1cccc(C2CCN(CC2)C(=O)c2n[nH]c3CNCCc23)c1Cl
: