Target
Retinol-binding protein 4
Ligand
BDBM249499
Substrate
Meas. Tech.
Scintillation Proximity Binding Assay
IC50
14.3±n/a nM
Citation
 Petrukhin, KCioffi, CJohnson, GAllikmets, RFreeman, EChen, PConlon, MZhu, L Substituted 4-phenylpiperidines, their preparation and use US Patent  US9777010 Publication Date 10/3/2017 
Target
Name:
Retinol-binding protein 4
Synonyms:
PRBP RBP RET4_HUMAN Retinol-binding protein 4 (RBP4) | spa binding assay for rbp4
Type:
Protein
Mol. Mass.:
23008.75
Organism:
Homo sapiens (Human)
Description:
P02753
Residue:
201
  
Inhibitor
Name:
BDBM249499
Synonyms:
US10072016, Compound 97 US10913746, Compound 97 US9434727, 97 | US9777010, Compound 97
Type:
Small organic molecule
Emp. Form.:
C22H23F5N4O
Mol. Mass.:
454.4362
SMILES:
Fc1ccc(C2CCN(CC2)C(=O)c2n[nH]c3CN(CC4CC4)Cc23)c(c1F)C(F)(F)F
: