Target
Retinol-binding protein 4
Ligand
BDBM249503
Substrate
Meas. Tech.
Scintillation Proximity Binding Assay
IC50
7.44±n/a nM
Citation
 Petrukhin, KCioffi, CJohnson, GAllikmets, RFreeman, EChen, PConlon, MZhu, L Substituted 4-phenylpiperidines, their preparation and use US Patent  US9777010 Publication Date 10/3/2017 
Target
Name:
Retinol-binding protein 4
Synonyms:
PRBP RBP RET4_HUMAN Retinol-binding protein 4 (RBP4) | spa binding assay for rbp4
Type:
Protein
Mol. Mass.:
23008.75
Organism:
Homo sapiens (Human)
Description:
P02753
Residue:
201
  
Inhibitor
Name:
BDBM249503
Synonyms:
US10072016, Compound 101 US10913746, Compound 101 US9434727, 101 | US9777010, Compound 101
Type:
Small organic molecule
Emp. Form.:
C20H19F5N4O3
Mol. Mass.:
458.3819
SMILES:
COC(=O)N1Cc2[nH]nc(C(=O)N3CCC(CC3)c3ccc(F)c(F)c3C(F)(F)F)c2C1
: