Target
Retinol-binding protein 4
Ligand
BDBM249516
Substrate
Meas. Tech.
Scintillation Proximity Binding Assay
IC50
10.3±n/a nM
Citation
 Petrukhin, KCioffi, CJohnson, GAllikmets, RFreeman, EChen, PConlon, MZhu, L Substituted 4-phenylpiperidines, their preparation and use US Patent  US9777010 Publication Date 10/3/2017 
Target
Name:
Retinol-binding protein 4
Synonyms:
PRBP RBP RET4_HUMAN Retinol-binding protein 4 (RBP4) | spa binding assay for rbp4
Type:
Protein
Mol. Mass.:
23008.75
Organism:
Homo sapiens (Human)
Description:
P02753
Residue:
201
  
Inhibitor
Name:
BDBM249516
Synonyms:
US10072016, Compound 114 US10913746, Compound 114 US9434727, 114 | US9777010, Compound 114
Type:
Small organic molecule
Emp. Form.:
C21H23F4N5O2
Mol. Mass.:
453.4332
SMILES:
CNC(=O)N1CCc2[nH]nc(C(=O)N3CCC(CC3)c3cccc(F)c3C(F)(F)F)c2C1
: