Target
Retinol-binding protein 4
Ligand
BDBM249517
Substrate
Meas. Tech.
Scintillation Proximity Binding Assay
IC50
18.9±n/a nM
Citation
 Petrukhin, KCioffi, CJohnson, GAllikmets, RFreeman, EChen, PConlon, MZhu, L Substituted 4-phenylpiperidines, their preparation and use US Patent  US9777010 Publication Date 10/3/2017 
Target
Name:
Retinol-binding protein 4
Synonyms:
PRBP RBP RET4_HUMAN Retinol-binding protein 4 (RBP4) | spa binding assay for rbp4
Type:
Protein
Mol. Mass.:
23008.75
Organism:
Homo sapiens (Human)
Description:
P02753
Residue:
201
  
Inhibitor
Name:
BDBM249517
Synonyms:
US10072016, Compound 115 US10913746, Compound 115 US9434727, 115 | US9777010, Compound 115
Type:
Small organic molecule
Emp. Form.:
C21H21F5N4O3
Mol. Mass.:
472.4085
SMILES:
OC(=O)CN1CCc2c(C1)[nH]nc2C(=O)N1CCC(CC1)c1ccc(F)c(F)c1C(F)(F)F
: