Target
Retinol-binding protein 4
Ligand
BDBM249539
Substrate
Meas. Tech.
Scintillation Proximity Binding Assay
IC50
18.4±n/a nM
Citation
 Petrukhin, KCioffi, CJohnson, GAllikmets, RFreeman, EChen, PConlon, MZhu, L Substituted 4-phenylpiperidines, their preparation and use US Patent  US9777010 Publication Date 10/3/2017 
Target
Name:
Retinol-binding protein 4
Synonyms:
PRBP RBP RET4_HUMAN Retinol-binding protein 4 (RBP4) | spa binding assay for rbp4
Type:
Protein
Mol. Mass.:
23008.75
Organism:
Homo sapiens (Human)
Description:
P02753
Residue:
201
  
Inhibitor
Name:
BDBM249539
Synonyms:
US10072016, Compound 137 US10913746, Compound 137 US9434727, 137 | US9777010, Compound 137
Type:
Small organic molecule
Emp. Form.:
C21H20F8N4O
Mol. Mass.:
496.3969
SMILES:
Fc1cc(F)c(c(c1)C1CCN(CC1)C(=O)c1n[nH]c2CN(CC(F)(F)F)CCc12)C(F)(F)F
: