Target
Retinol-binding protein 4
Ligand
BDBM249549
Substrate
Meas. Tech.
Scintillation Proximity Binding Assay
IC50
17.1±n/a nM
Citation
 Petrukhin, KCioffi, CJohnson, GAllikmets, RFreeman, EChen, PConlon, MZhu, L Substituted 4-phenylpiperidines, their preparation and use US Patent  US9777010 Publication Date 10/3/2017 
Target
Name:
Retinol-binding protein 4
Synonyms:
PRBP RBP RET4_HUMAN Retinol-binding protein 4 (RBP4) | spa binding assay for rbp4
Type:
Protein
Mol. Mass.:
23008.75
Organism:
Homo sapiens (Human)
Description:
P02753
Residue:
201
  
Inhibitor
Name:
BDBM249549
Synonyms:
US10072016, Compound 147 US10913746, Compound 147 US9434727, 147 | US9777010, Compound 147
Type:
Small organic molecule
Emp. Form.:
C20H22ClFN4O3
Mol. Mass.:
420.865
SMILES:
COC(=O)N1CCc2c(C1)[nH]nc2C(=O)N1CCC(CC1)c1cccc(F)c1Cl
: