Target
Retinol-binding protein 4
Ligand
BDBM249555
Substrate
Meas. Tech.
Scintillation Proximity Binding Assay
IC50
149±n/a nM
Citation
 Petrukhin, KCioffi, CJohnson, GAllikmets, RFreeman, EChen, PConlon, MZhu, L Substituted 4-phenylpiperidines, their preparation and use US Patent  US9777010 Publication Date 10/3/2017 
Target
Name:
Retinol-binding protein 4
Synonyms:
PRBP RBP RET4_HUMAN Retinol-binding protein 4 (RBP4) | spa binding assay for rbp4
Type:
Protein
Mol. Mass.:
23008.75
Organism:
Homo sapiens (Human)
Description:
P02753
Residue:
201
  
Inhibitor
Name:
BDBM249555
Synonyms:
US10072016, Compound 153 US10913746, Compound 153 US9434727, 153 | US9777010, Compound 153
Type:
Small organic molecule
Emp. Form.:
C22H22F6N4O2
Mol. Mass.:
488.4261
SMILES:
CC(=O)N1CCc2c(C1)[nH]nc2C(=O)N1CCC(CC1)c1cc(cc(c1)C(F)(F)F)C(F)(F)F
: