Target
Retinol-binding protein 4
Ligand
BDBM249567
Substrate
Meas. Tech.
Scintillation Proximity Binding Assay
IC50
15.6±n/a nM
Citation
 Petrukhin, KCioffi, CJohnson, GAllikmets, RFreeman, EChen, PConlon, MZhu, L Substituted 4-phenylpiperidines, their preparation and use US Patent  US9777010 Publication Date 10/3/2017 
Target
Name:
Retinol-binding protein 4
Synonyms:
PRBP RBP RET4_HUMAN Retinol-binding protein 4 (RBP4) | spa binding assay for rbp4
Type:
Protein
Mol. Mass.:
23008.75
Organism:
Homo sapiens (Human)
Description:
P02753
Residue:
201
  
Inhibitor
Name:
BDBM249567
Synonyms:
US10072016, Compound 165 US10913746, Compound 165 US9434727, 165 | US9777010, Compound 165
Type:
Small organic molecule
Emp. Form.:
C21H24ClFN4O2
Mol. Mass.:
418.892
SMILES:
Fc1cccc(C2CCN(CC2)C(=O)c2n[nH]c3CCN(Cc23)C2COC2)c1Cl
: