Target
Retinol-binding protein 4
Ligand
BDBM249570
Substrate
Meas. Tech.
Scintillation Proximity Binding Assay
IC50
15.5±n/a nM
Citation
 Petrukhin, KCioffi, CJohnson, GAllikmets, RFreeman, EChen, PConlon, MZhu, L Substituted 4-phenylpiperidines, their preparation and use US Patent  US9777010 Publication Date 10/3/2017 
Target
Name:
Retinol-binding protein 4
Synonyms:
PRBP RBP RET4_HUMAN Retinol-binding protein 4 (RBP4) | spa binding assay for rbp4
Type:
Protein
Mol. Mass.:
23008.75
Organism:
Homo sapiens (Human)
Description:
P02753
Residue:
201
  
Inhibitor
Name:
BDBM249570
Synonyms:
US10072016, Compound 168 US10913746, Compound 168 US9434727, 168 | US9777010, Compound 168
Type:
Small organic molecule
Emp. Form.:
C21H26ClFN4O2
Mol. Mass.:
420.908
SMILES:
COCCN1CCc2[nH]nc(C(=O)N3CCC(CC3)c3cccc(F)c3Cl)c2C1
: