Target
Retinol-binding protein 4
Ligand
BDBM249571
Substrate
Meas. Tech.
Scintillation Proximity Binding Assay
IC50
33.0±n/a nM
Citation
 Petrukhin, KCioffi, CJohnson, GAllikmets, RFreeman, EChen, PConlon, MZhu, L Substituted 4-phenylpiperidines, their preparation and use US Patent  US9777010 Publication Date 10/3/2017 
Target
Name:
Retinol-binding protein 4
Synonyms:
PRBP RBP RET4_HUMAN Retinol-binding protein 4 (RBP4) | spa binding assay for rbp4
Type:
Protein
Mol. Mass.:
23008.75
Organism:
Homo sapiens (Human)
Description:
P02753
Residue:
201
  
Inhibitor
Name:
BDBM249571
Synonyms:
US10072016, Compound 169 US10913746, Compound 169 US9434727, 169 | US9777010, Compound 169
Type:
Small organic molecule
Emp. Form.:
C23H25F5N6O2
Mol. Mass.:
512.4756
SMILES:
Fc1ccc(C2CCN(CC2)C(=O)c2n[nH]c3CN(Cc23)C(=O)N2CCNCC2)c(c1F)C(F)(F)F
: