Target
Tyrosine-protein kinase JAK2
Ligand
BDBM344033
Substrate
Meas. Tech.
In Vitro JAK Kinase Assay
IC50
<1000±n/a nM
Citation
 Li, YZhu, WMei, S Tricyclic fused thiophene derivatives as JAK inhibitors US Patent  US9777017 Publication Date 10/3/2017 
Target
Name:
Tyrosine-protein kinase JAK2
Synonyms:
JAK-2 JAK2_HUMAN Janus kinase 2 (JAK2) | Janus kinase 2 (a protein tyrosine kinase)
Type:
Protein
Mol. Mass.:
130684.68
Organism:
Homo sapiens (Human)
Description:
O60674
Residue:
1132
  
Inhibitor
Name:
BDBM344033
Synonyms:
US10370387, Example 17 US9777017, Example 17 | US9908895, Example 17
Type:
Small organic molecule
Emp. Form.:
C17H18N4OS
Mol. Mass.:
326.416
SMILES:
OCc1nc2cnc3ccsc3c2n1[C@H]1CC[C@H](CC#N)CC1
: