Target
Tyrosine-protein kinase JAK1
Ligand
BDBM344041
Substrate
Meas. Tech.
In Vitro JAK Kinase Assay
IC50
<100±n/a nM
Citation
 Li, YZhu, WMei, S Tricyclic fused thiophene derivatives as JAK inhibitors US Patent  US9777017 Publication Date 10/3/2017 
Target
Name:
Tyrosine-protein kinase JAK1
Synonyms:
JAK-1 JAK1A JAK1_HUMAN Janus kinase 1 (JAK1) | Janus kinase 1 JAK1
Type:
Protein
Mol. Mass.:
133293.73
Organism:
Homo sapiens (Human)
Description:
P23458
Residue:
1154
  
Inhibitor
Name:
BDBM344041
Synonyms:
US10370387, Example 25 US9777017, Example 25 | US9908895, Example 25
Type:
Small organic molecule
Emp. Form.:
C17H16N6S
Mol. Mass.:
336.414
SMILES:
N#CC[C@H]1CC[C@@H](CC1)n1c2c(cnc3ccsc23)[nH]\c1=N/C#N
: