Target
Tyrosine-protein kinase JAK1
Ligand
BDBM344046
Substrate
Meas. Tech.
In Vitro JAK Kinase Assay
IC50
<2000±n/a nM
Citation
 Li, YZhu, WMei, S Tricyclic fused thiophene derivatives as JAK inhibitors US Patent  US9777017 Publication Date 10/3/2017 
Target
Name:
Tyrosine-protein kinase JAK1
Synonyms:
JAK-1 JAK1A JAK1_HUMAN Janus kinase 1 (JAK1) | Janus kinase 1 JAK1
Type:
Protein
Mol. Mass.:
133293.73
Organism:
Homo sapiens (Human)
Description:
P23458
Residue:
1154
  
Inhibitor
Name:
BDBM344046
Synonyms:
US10370387, Example 30 | US9777017, Example 30
Type:
Small organic molecule
Emp. Form.:
C19H23N5OS
Mol. Mass.:
369.484
SMILES:
C[C@@H](O)c1nc2cnc3ccsc3c2n1C1CCC(CC1)NCCC#N
: