Target
Tyrosine-protein kinase JAK2
Ligand
BDBM344069
Substrate
Meas. Tech.
In Vitro JAK Kinase Assay
IC50
>20000±n/a nM
Citation
 Li, YZhu, WMei, S Tricyclic fused thiophene derivatives as JAK inhibitors US Patent  US9777017 Publication Date 10/3/2017 
Target
Name:
Tyrosine-protein kinase JAK2
Synonyms:
JAK-2 JAK2_HUMAN Janus kinase 2 (JAK2) | Janus kinase 2 (a protein tyrosine kinase)
Type:
Protein
Mol. Mass.:
130684.68
Organism:
Homo sapiens (Human)
Description:
O60674
Residue:
1132
  
Inhibitor
Name:
BDBM344069
Synonyms:
US11161855, Example 53 | US9777017, Example 53
Type:
Small organic molecule
Emp. Form.:
C21H26N6O2S
Mol. Mass.:
426.535
SMILES:
C[C@@H](O)c1nc2cnc3ccsc3c2n1[C@H]1CCCN(C1)C(=O)CC\C(=C\N)C=N
: