Target
Tyrosine-protein kinase JAK2
Ligand
BDBM344083
Substrate
Meas. Tech.
In Vitro JAK Kinase Assay
IC50
>2000±n/a nM
Citation
 Li, YZhu, WMei, S Tricyclic fused thiophene derivatives as JAK inhibitors US Patent  US9777017 Publication Date 10/3/2017 
Target
Name:
Tyrosine-protein kinase JAK2
Synonyms:
JAK-2 JAK2_HUMAN Janus kinase 2 (JAK2) | Janus kinase 2 (a protein tyrosine kinase)
Type:
Protein
Mol. Mass.:
130684.68
Organism:
Homo sapiens (Human)
Description:
O60674
Residue:
1132
  
Inhibitor
Name:
BDBM344083
Synonyms:
US10370387, Example 67 US9777017, Example 67 | US9908895, Example 67
Type:
Small organic molecule
Emp. Form.:
C18H21N5OS
Mol. Mass.:
355.457
SMILES:
C[C@@H](O)c1nc2cnc3ccsc3c2n1[C@H]1CC[C@H](CC#N)[C@H](N)C1
: