Target
Tyrosine-protein kinase JAK1
Ligand
BDBM344084
Substrate
Meas. Tech.
In Vitro JAK Kinase Assay
IC50
<100±n/a nM
Citation
 Li, YZhu, WMei, S Tricyclic fused thiophene derivatives as JAK inhibitors US Patent  US9777017 Publication Date 10/3/2017 
Target
Name:
Tyrosine-protein kinase JAK1
Synonyms:
JAK-1 JAK1A JAK1_HUMAN Janus kinase 1 (JAK1) | Janus kinase 1 JAK1
Type:
Protein
Mol. Mass.:
133293.73
Organism:
Homo sapiens (Human)
Description:
P23458
Residue:
1154
  
Inhibitor
Name:
BDBM344084
Synonyms:
US10370387, Example 68 US9777017, Example 68
Type:
Small organic molecule
Emp. Form.:
C17H19N5OS
Mol. Mass.:
341.431
SMILES:
CC(N)c1nc2cnc3ccsc3c2n1[C@H]1CC[C@H](CC#N)OC1
: