Target
Tyrosine-protein kinase JAK1
Ligand
BDBM344093
Substrate
Meas. Tech.
In Vitro JAK Kinase Assay
IC50
<100±n/a nM
Citation
 Li, YZhu, WMei, S Tricyclic fused thiophene derivatives as JAK inhibitors US Patent  US9777017 Publication Date 10/3/2017 
Target
Name:
Tyrosine-protein kinase JAK1
Synonyms:
JAK-1 JAK1A JAK1_HUMAN Janus kinase 1 (JAK1) | Janus kinase 1 JAK1
Type:
Protein
Mol. Mass.:
133293.73
Organism:
Homo sapiens (Human)
Description:
P23458
Residue:
1154
  
Inhibitor
Name:
BDBM344093
Synonyms:
US10370387, Example 77 US9777017, Example 77 | US9908895, Example 77
Type:
Small organic molecule
Emp. Form.:
C17H20N4S
Mol. Mass.:
312.432
SMILES:
CC(=N)C(\[C@H]1CC[C@H](CC#N)CC1)=C1/NC=Nc2ccsc12
: