Target
Tyrosine-protein kinase JAK2
Ligand
BDBM344099
Substrate
Meas. Tech.
In Vitro JAK Kinase Assay
IC50
<1000±n/a nM
Citation
 Li, YZhu, WMei, S Tricyclic fused thiophene derivatives as JAK inhibitors US Patent  US9777017 Publication Date 10/3/2017 
Target
Name:
Tyrosine-protein kinase JAK2
Synonyms:
JAK-2 JAK2_HUMAN Janus kinase 2 (JAK2) | Janus kinase 2 (a protein tyrosine kinase)
Type:
Protein
Mol. Mass.:
130684.68
Organism:
Homo sapiens (Human)
Description:
O60674
Residue:
1132
  
Inhibitor
Name:
BDBM344099
Synonyms:
US10370387, Example 83 US9777017, Example 83 | US9908895, Example 83
Type:
Small organic molecule
Emp. Form.:
C21H28N4O3S
Mol. Mass.:
416.537
SMILES:
CCCOC(=O)NC[C@H]1CC[C@@H](CC1)n1c(nc2cnc3ccsc3c12)[C@@H](C)O
: