Target
High affinity nerve growth factor receptor
Ligand
BDBM344173
Substrate
IC50
1080±n/a nM
Citation
 Altenbach, RJLiu, HClapham, BAguirre, ALCowart, MKoenig, JRSarris, KScanio, MJSwinger, KKVasudevan, AVillamil, CIWoller, KR Furo-3-carboxamide derivatives and methods of use US Patent  US9777020 Publication Date 10/3/2017 
Target
Name:
High affinity nerve growth factor receptor
Synonyms:
2.7.10.1 NTRK1 NTRK1_HUMAN Neurotrophic tyrosine kinase receptor type 1 Synonyms=MTC TRK1-transforming tyrosine kinase protein TRKA GN Tropomyosin alpha-3 chain/High affinity nerve growth factor receptor Tropomyosin-related kinase A (TrkA) Tyrosine kinase receptor (Trk) Tyrosine kinase receptor A (Trk A) Tyrosine kinase receptor A (TrkA) p140-TrkA
Type:
Mol. Mass.:
87498.18
Organism:
Homo sapiens (Human)
Description:
P04629
Residue:
796
  
Inhibitor
Name:
BDBM344173
Synonyms:
N-(4-cyanophenyl)-5-methyl-4-oxo-4,5,6,7-tetrahydrofuro[3,2-c]pyridine-3-carboxamide | US9777020, Example 67
Type:
Small organic molecule
Emp. Form.:
C16H13N3O3
Mol. Mass.:
295.2927
SMILES:
CN1CCc2occ(C(=O)Nc3ccc(cc3)C#N)c2C1=O
: