Target
High affinity nerve growth factor receptor
Ligand
BDBM344192
Substrate
IC50
1320±n/a nM
Citation
 Altenbach, RJLiu, HClapham, BAguirre, ALCowart, MKoenig, JRSarris, KScanio, MJSwinger, KKVasudevan, AVillamil, CIWoller, KR Furo-3-carboxamide derivatives and methods of use US Patent  US9777020 Publication Date 10/3/2017 
Target
Name:
High affinity nerve growth factor receptor
Synonyms:
2.7.10.1 NTRK1 NTRK1_HUMAN Neurotrophic tyrosine kinase receptor type 1 Synonyms=MTC TRK1-transforming tyrosine kinase protein TRKA GN Tropomyosin alpha-3 chain/High affinity nerve growth factor receptor Tropomyosin-related kinase A (TrkA) Tyrosine kinase receptor (Trk) Tyrosine kinase receptor A (Trk A) Tyrosine kinase receptor A (TrkA) p140-TrkA
Type:
Mol. Mass.:
87498.18
Organism:
Homo sapiens (Human)
Description:
P04629
Residue:
796
  
Inhibitor
Name:
BDBM344192
Synonyms:
N-{6-(4-acetylpiperazin-1-yl)-2-[2-(benzyloxy)ethoxy]pyridin-3-yl}-5-[2-(benzyloxy)ethyl]-4-oxo-4,5,6,7-tetrahydrofuro[3,2-c]pyridine-3-carboxamide | US9777020, Example 86
Type:
Small organic molecule
Emp. Form.:
C37H41N5O7
Mol. Mass.:
667.7507
SMILES:
CC(=O)N1CCN(CC1)c1ccc(NC(=O)c2coc3CCN(CCOCc4ccccc4)C(=O)c23)c(OCCOCc2ccccc2)n1
: