Target
High affinity nerve growth factor receptor
Ligand
BDBM344198
Substrate
IC50
18.2±n/a nM
Citation
 Altenbach, RJLiu, HClapham, BAguirre, ALCowart, MKoenig, JRSarris, KScanio, MJSwinger, KKVasudevan, AVillamil, CIWoller, KR Furo-3-carboxamide derivatives and methods of use US Patent  US9777020 Publication Date 10/3/2017 
Target
Name:
High affinity nerve growth factor receptor
Synonyms:
2.7.10.1 NTRK1 NTRK1_HUMAN Neurotrophic tyrosine kinase receptor type 1 Synonyms=MTC TRK1-transforming tyrosine kinase protein TRKA GN Tropomyosin alpha-3 chain/High affinity nerve growth factor receptor Tropomyosin-related kinase A (TrkA) Tyrosine kinase receptor (Trk) Tyrosine kinase receptor A (Trk A) Tyrosine kinase receptor A (TrkA) p140-TrkA
Type:
Mol. Mass.:
87498.18
Organism:
Homo sapiens (Human)
Description:
P04629
Residue:
796
  
Inhibitor
Name:
BDBM344198
Synonyms:
US9777020, Example 92 | tert-butyl 4-(6-ethoxy-5-{[(4-oxo-4,5,6,7-tetrahydrofuro[3,2-c]pyridin-3-yl)carbonyl]amino}pyridin-2-yl)piperazine-1-carboxylate
Type:
Small organic molecule
Emp. Form.:
C24H31N5O6
Mol. Mass.:
485.5328
SMILES:
CCOc1nc(ccc1NC(=O)c1coc2CCNC(=O)c12)N1CCN(CC1)C(=O)OC(C)(C)C
: