Target
High affinity nerve growth factor receptor
Ligand
BDBM344257
Substrate
IC50
63.4±n/a nM
Citation
 Altenbach, RJLiu, HClapham, BAguirre, ALCowart, MKoenig, JRSarris, KScanio, MJSwinger, KKVasudevan, AVillamil, CIWoller, KR Furo-3-carboxamide derivatives and methods of use US Patent  US9777020 Publication Date 10/3/2017 
Target
Name:
High affinity nerve growth factor receptor
Synonyms:
2.7.10.1 NTRK1 NTRK1_HUMAN Neurotrophic tyrosine kinase receptor type 1 Synonyms=MTC TRK1-transforming tyrosine kinase protein TRKA GN Tropomyosin alpha-3 chain/High affinity nerve growth factor receptor Tropomyosin-related kinase A (TrkA) Tyrosine kinase receptor (Trk) Tyrosine kinase receptor A (Trk A) Tyrosine kinase receptor A (TrkA) p140-TrkA
Type:
Mol. Mass.:
87498.18
Organism:
Homo sapiens (Human)
Description:
P04629
Residue:
796
  
Inhibitor
Name:
BDBM344257
Synonyms:
6,6-dimethyl-4-oxo-N-[5-(piperazin-1-yl)pyridin-2-yl]-4,5,6,7-tetrahydro-1-benzofuran-3-carboxamide | US9777020, Example 151
Type:
Small organic molecule
Emp. Form.:
C20H24N4O3
Mol. Mass.:
368.4296
SMILES:
CC1(C)Cc2occ(C(=O)Nc3ccc(cn3)N3CCNCC3)c2C(=O)C1
: