Target
High affinity nerve growth factor receptor
Ligand
BDBM127667
Substrate
Meas. Tech.
TrkA ELISA Assay
IC50
0.800±n/a nM
Citation
 Allen, SAndrews, SWCondroski, KRHaas, JHuang, LJiang, YKercher, TSeo, J Substituted pyrazolo[1,5-a]pyrimidine compounds as Trk kinase inhibitors US Patent  US9782415 Publication Date 10/10/2017 
Target
Name:
High affinity nerve growth factor receptor
Synonyms:
2.7.10.1 NTRK1 NTRK1_HUMAN Neurotrophic tyrosine kinase receptor type 1 Synonyms=MTC TRK1-transforming tyrosine kinase protein TRKA GN Trk-A Tropomyosin-related kinase A Tyrosine kinase receptor Tyrosine kinase receptor A Tyrosine kinase receptor A (Trk-A) gp140trk | p140-TrkA
Type:
Mol. Mass.:
87498.18
Organism:
Homo sapiens (Human)
Description:
P04629
Residue:
796
  
Inhibitor
Name:
BDBM127667
Synonyms:
US10251889, Example 40 US8791123, 40 US9796724, Example 40
Type:
Small organic molecule
Emp. Form.:
C21H22F3N5O
Mol. Mass.:
417.4275
SMILES:
CC(C)(CF)NC(=O)c1cnn2ccc(nc12)N1CCC[C@@H]1c1cc(F)ccc1F
: