Target
Histone deacetylase 4
Ligand
BDBM344309
Substrate
Meas. Tech.
Inhibition Assay
IC50
>50000±n/a nM
Citation
 Dominguez, CMuñoz-Sanjuán, IMaillard, MRaphy, GHaughan, AFLuckhurst, CAJarvis, REBürli, RWBreccia, PWishart, GHughes, SJAllen, DRPenrose, SD Histone deacetylase inhibitors and compositions and methods of use thereof US Patent  US9783488 Publication Date 10/10/2017 
Target
Name:
Histone deacetylase 4
Synonyms:
Cereblon/Histone deacetylase 4 HDAC4 Histone acetylase 4(HDAC4) KIAA0288
Type:
Enzyme
Mol. Mass.:
119049.39
Organism:
Homo sapiens (Human)
Description:
P56524
Residue:
1084
  
Inhibitor
Name:
BDBM344309
Synonyms:
1-(2,3-dihydrobenzofuran-7-yl)-N-hydroxycyclopentanecarboxamide | US9783488, Example 16
Type:
Small organic molecule
Emp. Form.:
C14H17NO3
Mol. Mass.:
247.2897
SMILES:
ONC(=O)C1(CCCC1)c1cccc2CCOc12
: