Target
Histone deacetylase 4
Ligand
BDBM344343
Substrate
Meas. Tech.
Inhibition Assay
IC50
720±n/a nM
Citation
 Dominguez, CMuñoz-Sanjuán, IMaillard, MRaphy, GHaughan, AFLuckhurst, CAJarvis, REBürli, RWBreccia, PWishart, GHughes, SJAllen, DRPenrose, SD Histone deacetylase inhibitors and compositions and methods of use thereof US Patent  US9783488 Publication Date 10/10/2017 
Target
Name:
Histone deacetylase 4
Synonyms:
Cereblon/Histone deacetylase 4 HDAC4 Histone acetylase 4(HDAC4) KIAA0288
Type:
Enzyme
Mol. Mass.:
119049.39
Organism:
Homo sapiens (Human)
Description:
P56524
Residue:
1084
  
Inhibitor
Name:
BDBM344343
Synonyms:
(1R,3S*)-1-(3-Fluoro-2- methylphenyl)-3-(5- fluoropyridin-3-yl)-N- hydroxycyclopentanecarboxamide | US9783488, Example 39
Type:
Small organic molecule
Emp. Form.:
C18H18F2N2O2
Mol. Mass.:
332.3445
SMILES:
Cc1c(F)cccc1[C@]1(CC[C@@H](C1)c1cncc(F)c1)C(=O)NO
: