Target
Histone deacetylase 4
Ligand
BDBM344366
Substrate
Meas. Tech.
Inhibition Assay
IC50
140±n/a nM
Citation
 Dominguez, CMuñoz-Sanjuán, IMaillard, MRaphy, GHaughan, AFLuckhurst, CAJarvis, REBürli, RWBreccia, PWishart, GHughes, SJAllen, DRPenrose, SD Histone deacetylase inhibitors and compositions and methods of use thereof US Patent  US9783488 Publication Date 10/10/2017 
Target
Name:
Histone deacetylase 4
Synonyms:
Cereblon/Histone deacetylase 4 HDAC4 Histone acetylase 4(HDAC4) KIAA0288
Type:
Enzyme
Mol. Mass.:
119049.39
Organism:
Homo sapiens (Human)
Description:
P56524
Residue:
1084
  
Inhibitor
Name:
BDBM344366
Synonyms:
(1S,3R*)-1-(3-fluoro-2-methylphenyl)-N-hydroxy-3-(1-methyl-1H-indazol-6-yl)cyclopentanecarboxamide | US9783488, Example 56
Type:
Small organic molecule
Emp. Form.:
C21H22FN3O2
Mol. Mass.:
367.4167
SMILES:
Cc1c(F)cccc1[C@@]1(CC[C@H](C1)c1ccc2cnn(C)c2c1)C(=O)NO
: