Target
Hepatocyte growth factor receptor
Ligand
BDBM344382
Substrate
Meas. Tech.
Kinase Assay
IC50
550±n/a nM
Citation
 Gong, PZhao, YLiu, YZhai, X Quinoline derivatives and their applications US Patent  US9783499 Publication Date 10/10/2017 
Target
Name:
Hepatocyte growth factor receptor
Synonyms:
Hepatocyte growth factor receptor Hepatocyte growth factor receptor (c-MET) MET Met proto-oncogene (hepatocyte growth factor receptor) Tyrosine-protein kinase Met (c-Met) c-Met kinase
Type:
Protein
Mol. Mass.:
155559.73
Organism:
Homo sapiens (Human)
Description:
P08581
Residue:
1390
  
Inhibitor
Name:
BDBM344382
Synonyms:
(E)-N1-(3-fluoro-4-(6-methoxy-7-(3-(pyrrolidin-1-yl)propoxy)quinoline-4-yloxy)phenyl)-N4-(3-methoxybenzaldehyde)semicarbazone | US9783499, Example 6
Type:
Small organic molecule
Emp. Form.:
C32H34FN5O5
Mol. Mass.:
587.6413
SMILES:
COc1cccc(\C=N\N(C(N)=O)c2ccc(Oc3ccnc4cc(OCCCN5CCCC5)c(OC)cc34)c(F)c2)c1
: