Target
Hepatocyte growth factor receptor
Ligand
BDBM344393
Substrate
Meas. Tech.
Kinase Assay
IC50
0.200±n/a nM
Citation
 Gong, PZhao, YLiu, YZhai, X Quinoline derivatives and their applications US Patent  US9783499 Publication Date 10/10/2017 
Target
Name:
Hepatocyte growth factor receptor
Synonyms:
Hepatocyte growth factor receptor Hepatocyte growth factor receptor (c-MET) MET Met proto-oncogene (hepatocyte growth factor receptor) Tyrosine-protein kinase Met (c-Met) c-Met kinase
Type:
Protein
Mol. Mass.:
155559.73
Organism:
Homo sapiens (Human)
Description:
P08581
Residue:
1390
  
Inhibitor
Name:
BDBM344393
Synonyms:
(E)-N1-(3-fluoro-4-(6-methoxy-7-(3-(piperidin-1-yl)propoxy)quinoline-4-yloxy)phenyl)-N4-(propiophenone)thiosemicarbazone | US9783499, Example 30
Type:
Small organic molecule
Emp. Form.:
C34H38FN5O4
Mol. Mass.:
599.695
SMILES:
CC\C(=N/N(C(N)=O)c1ccc(Oc2ccnc3cc(OCCCN4CCCCC4)c(OC)cc23)c(F)c1)c1ccccc1
: